Target
Putative inactive group IIC secretory phospholipase A2
Ligand
BDBM50289485
Substrate
Meas. Tech.
ChEBML_199687
IC50
570±n/a nM
Citation
 Lee, DMarshall, LABolognese, BAdams, JL Tetrazole is an effective Sn-3 phosphate replacement in substrate analog inhibitors of 14 kDa phospholipase A2 Bioorg Med Chem Lett 7:1427-1432 (1997)    Article 
Target
Name:
Putative inactive group IIC secretory phospholipase A2
Synonyms:
PA2GC_HUMAN Phosphatidylcholine 2-acylhydrolase-like protein GIIC Putative inactive group IIC secretory phospholipase A2
Type:
PROTEIN
Mol. Mass.:
16855.80
Organism:
Homo sapiens (Human)
Description:
ChEMBL_199685
Residue:
149
  
Inhibitor
Name:
BDBM50289485
Synonyms:
CHEMBL289247 | N-[1-Octadecyloxymethyl-3-(1H-tetrazol-5-yl)-propyl]-acetamide
Type:
Small organic molecule
Emp. Form.:
C25H49N5O2
Mol. Mass.:
451.6889
SMILES:
(CCc1nnn[nH]1)NC(C)=O
: