Target
Putative inactive group IIC secretory phospholipase A2
Ligand
BDBM50289492
Substrate
Meas. Tech.
ChEMBL_199687 (CHEMBL802916)
IC50
>200000±n/a nM
Citation
 Lee, DMarshall, LABolognese, BAdams, JL Tetrazole is an effective Sn-3 phosphate replacement in substrate analog inhibitors of 14 kDa phospholipase A2 Bioorg Med Chem Lett 7:1427-1432 (1997)    Article 
Target
Name:
Putative inactive group IIC secretory phospholipase A2
Synonyms:
PA2GC_HUMAN Phosphatidylcholine 2-acylhydrolase-like protein GIIC Putative inactive group IIC secretory phospholipase A2
Type:
PROTEIN
Mol. Mass.:
16855.80
Organism:
Homo sapiens (Human)
Description:
ChEMBL_199685
Residue:
149
  
Inhibitor
Name:
BDBM50289492
Synonyms:
CHEMBL34624 | N-[1-Octadecyloxymethyl-2-(toluene-4-sulfonylamino)-ethyl]-acetamide
Type:
Small organic molecule
Emp. Form.:
C30H54N2O4S
Mol. Mass.:
538.826
SMILES:
(CNS(=O)(=O)c1ccc(C)cc1)NC(C)=O
: