Target
Plasminogen
Ligand
BDBM50290018
Substrate
Meas. Tech.
ChEBML_155058
IC50
74000±n/a nM
Citation
 Salimbeni, APaleari, FCanevotti, RCriscuoli, MCriscuoli, MLippi, AAngiolini, MBelvisi, LScolastico, CColombo, L Design and synthesis of conformationally constrained arginal thrombin inhibitors Bioorg Med Chem Lett 7:2205-2210 (1997)    Article 
Target
Name:
Plasminogen
Synonyms:
Activation peptide PLG Plasmin Plasmin heavy chain A, short form | Plasmin light chain B
Type:
Enzyme
Mol. Mass.:
90579.18
Organism:
Homo sapiens (Human)
Description:
Residue:
810
  
Inhibitor
Name:
BDBM50290018
Synonyms:
(3S,6S,9aS)-6-Acetylamino-5-oxo-octahydro-pyrrolo[1,2-a]azepine-3-carboxylic acid ((S)-1-carbamimidoyl-2-hydroxy-piperidin-3-yl)-amide; hydrochloride | CHEMBL557616
Type:
Small organic molecule
Emp. Form.:
C18H30N6O4
Mol. Mass.:
394.4686
SMILES:
CC(=O)N[C@H]1CCC[C@H]2CC[C@H](N2C1=O)C(=O)N[C@H]1CCCN(C1O)C(N)=N
: