Target
Mu-type opioid receptor
Ligand
BDBM50061063
Substrate
Meas. Tech.
ChEBML_138866
Ki
93±n/a nM
Citation
 Dondio, GRonzoni, SPetrillo, PDesJarlais, RLRaveglia, LF Pyrrolooctahydroisoquinolines as potent and selective opioid receptor ligands: SAR analysis and docking studies Bioorg Med Chem Lett 7:2967-2972 (1997)    Article 
Target
Name:
Mu-type opioid receptor
Synonyms:
M-OR-1 Mor OPRM_MOUSE Oprm | Oprm1
Type:
Enzyme Catalytic Domain
Mol. Mass.:
44431.62
Organism:
MOUSE
Description:
OPIATE Mu OPRM1 MOUSE::P42866
Residue:
398
  
Inhibitor
Name:
BDBM50061063
Synonyms:
(4aR,8aS)-8a-(3-Hydroxy-phenyl)-3,6-dimethyl-4,4a,5,6,7,8,8a,9-octahydro-1H-pyrrolo[2,3-g]isoquinoline-2-carboxylic acid diethylamide | CHEMBL108076
Type:
Small organic molecule
Emp. Form.:
C24H33N3O2
Mol. Mass.:
395.5377
SMILES:
CCN(CC)C(=O)c1[nH]c2C[C@]3(CCN(C)C[C@@H]3Cc2c1C)c1cccc(O)c1
: