Target
Mu-type opioid receptor
Ligand
BDBM50290872
Substrate
Meas. Tech.
ChEBML_138866
Ki
60±n/a nM
Citation
 Dondio, GRonzoni, SPetrillo, PDesJarlais, RLRaveglia, LF Pyrrolooctahydroisoquinolines as potent and selective opioid receptor ligands: SAR analysis and docking studies Bioorg Med Chem Lett 7:2967-2972 (1997)    Article 
Target
Name:
Mu-type opioid receptor
Synonyms:
M-OR-1 Mor OPRM_MOUSE Oprm | Oprm1
Type:
Enzyme Catalytic Domain
Mol. Mass.:
44431.62
Organism:
MOUSE
Description:
OPIATE Mu OPRM1 MOUSE::P42866
Residue:
398
  
Inhibitor
Name:
BDBM50290872
Synonyms:
(-)-rel-3-((4aR,12aS)-2-methyl-1,2,3,4,4a,5,12,12a-octahydropyrido[3,4-b]acridin-4a-yl)phenol CHEMBL327745 TAN-67 | Tan-67 (racemic)
Type:
Small organic molecule
Emp. Form.:
C23H24N2O
Mol. Mass.:
344.4495
SMILES:
CN1CC[C@@]2(Cc3nc4ccccc4cc3C[C@H]2C1)c1cccc(O)c1
: