Target
Mu-type opioid receptor
Ligand
BDBM50290867
Substrate
Meas. Tech.
ChEBML_138866
Ki
139±n/a nM
Citation
 Dondio, GRonzoni, SPetrillo, PDesJarlais, RLRaveglia, LF Pyrrolooctahydroisoquinolines as potent and selective opioid receptor ligands: SAR analysis and docking studies Bioorg Med Chem Lett 7:2967-2972 (1997)    Article 
Target
Name:
Mu-type opioid receptor
Synonyms:
M-OR-1 Mor OPRM_MOUSE Oprm | Oprm1
Type:
Enzyme Catalytic Domain
Mol. Mass.:
44431.62
Organism:
MOUSE
Description:
OPIATE Mu OPRM1 MOUSE::P42866
Residue:
398
  
Inhibitor
Name:
BDBM50290867
Synonyms:
(4aR,8aS)-6-Ethyl-8a-(3-hydroxy-phenyl)-3-methyl-4,4a,5,6,7,8,8a,9-octahydro-1H-pyrrolo[2,3-g]isoquinoline-2-carboxylic acid amide | CHEMBL327956
Type:
Small organic molecule
Emp. Form.:
C21H27N3O2
Mol. Mass.:
353.458
SMILES:
CCN1CC[C@@]2(Cc3[nH]c(C(N)=O)c(C)c3C[C@H]2C1)c1cccc(O)c1
: