Target
Delta-type opioid receptor
Ligand
BDBM50061061
Substrate
Meas. Tech.
ChEBML_53570
Ki
1.9±n/a nM
Citation
 Dondio, GRonzoni, SPetrillo, PDesJarlais, RLRaveglia, LF Pyrrolooctahydroisoquinolines as potent and selective opioid receptor ligands: SAR analysis and docking studies Bioorg Med Chem Lett 7:2967-2972 (1997)    Article 
Target
Name:
Delta-type opioid receptor
Synonyms:
DOR-1 MSL-2 OPRD_MOUSE Oprd1
Type:
Enzyme Catalytic Domain
Mol. Mass.:
40577.25
Organism:
MOUSE
Description:
P32300
Residue:
372
  
Inhibitor
Name:
BDBM50061061
Synonyms:
(4aR,8aS)-6-Ethyl-8a-(3-hydroxy-phenyl)-3-methyl-4,4a,5,6,7,8,8a,9-octahydro-1H-pyrrolo[2,3-g]isoquinoline-2-carboxylic acid diethylamide | CHEMBL100729
Type:
Small organic molecule
Emp. Form.:
C25H35N3O2
Mol. Mass.:
409.5643
SMILES:
CCN(CC)C(=O)c1[nH]c2C[C@]3(CCN(CC)C[C@@H]3Cc2c1C)c1cccc(O)c1
: