Target
D(4) dopamine receptor
Ligand
BDBM50027331
Substrate
Meas. Tech.
ChEBML_58936
Ki
2500±n/a nM
Citation
 Hegde, VRDai, PLadislaw, CPatel, MGPuar, MSPachter, JA D4 dopamine receptor-selective compounds from the Chinese plant Phoebe chekiangensis Bioorg Med Chem Lett 7:1207-1212 (1997)    Article 
Target
Name:
D(4) dopamine receptor
Synonyms:
D(2C) dopamine receptor DOPAMINE D4.2 DRD4 Dopamine D4 receptor
Type:
Enzyme
Mol. Mass.:
48373.19
Organism:
Homo sapiens (Human)
Description:
P21917
Residue:
419
  
Inhibitor
Name:
BDBM50027331
Synonyms:
1-(3,4-dihydroxybenzyl)-1,2,3,4-tetrahydroisoquinoline-6,7-diol CHEMBL19068 | norlaudanosoline
Type:
Small organic molecule
Emp. Form.:
C16H17NO4
Mol. Mass.:
287.3105
SMILES:
Oc1ccc(CC2NCCc3cc(O)c(O)cc23)cc1O
: