Target
Gag-Pol polyprotein [489-587]
Ligand
BDBM50366556
Substrate
Meas. Tech.
ChEBML_159310
IC50
4400±n/a nM
Citation
 Ulysse, LGChmielewski, J Restricting the flexibility of crosslinked, interfacial peptide inhibitors of HIV-1 protease. Bioorg Med Chem Lett 8:3281-6 (1999)  
Target
Name:
Gag-Pol polyprotein [489-587]
Synonyms:
Human immunodeficiency virus type 1 protease Pol polyprotein | gag-pol
Type:
Enzyme Subunit
Mol. Mass.:
10781.16
Organism:
Human immunodeficiency virus type 1
Description:
P04585[489-587]
Residue:
99
  
Inhibitor
Name:
BDBM50366556
Synonyms:
CHEMBL1790835
Type:
Small organic molecule
Emp. Form.:
C81H124N14O20
Mol. Mass.:
1613.9331
SMILES:
CC[C@H](C)[C@H](NC(=O)[C@H](CCC(N)=O)NC(=O)[C@@H]1CCCN1C(=O)CCCCCCC\C=C/CCCCCCCC(=O)N[C@H](CO)C(=O)N[C@H]([C@H](C)O)C(=O)N[C@H](CC(C)C)C(=O)N[C@H](CC(N)=O)C(=O)N[C@H](Cc1ccccc1)C(O)=O)C(=O)N[C@@H]([C@@H](C)O)C(=O)N[C@@H](CC(C)C)C(=O)N[C@@H](Cc1c[nH]c2ccccc12)C(O)=O
: