Target
Glyceraldehyde-3-phosphate dehydrogenase
Ligand
BDBM50366560
Substrate
Meas. Tech.
ChEBML_72905
Ki
9000±n/a nM
Citation
 Aronov, AMGelb, MH Synthesis and structure-activity relationships of adenosine analogs as inhibitors of trypanosomal glyceraldehyde-3-phosphate dehydrogenase. Modifications at positions 5' and 8. Bioorg Med Chem Lett 8:3505-10 (1999)  
Target
Name:
Glyceraldehyde-3-phosphate dehydrogenase
Synonyms:
G3P_HUMAN GAPDH | Glyceraldehyde-3-phosphate dehydrogenase liver
Type:
PROTEIN
Mol. Mass.:
36060.86
Organism:
Homo sapiens (Human)
Description:
ChEMBL_1511315
Residue:
335
  
Inhibitor
Name:
BDBM50366560
Synonyms:
CHEMBL607760
Type:
Small organic molecule
Emp. Form.:
C19H23N5O4S
Mol. Mass.:
417.482
SMILES:
[#6]\[#6](-[#6])=[#6]\[#6]-[#7]-c1ncnc2n(-[#6]-3-[#8]-[#6@H](-[#6]-[#8])-[#6@@H](-[#8])-[#6@H]-3-[#8])c(nc12)-c1cccs1
: