Target
Glyceraldehyde-3-phosphate dehydrogenase
Ligand
BDBM50366561
Substrate
Meas. Tech.
ChEBML_72905
Ki
800000±n/a nM
Citation
 Aronov, AMGelb, MH Synthesis and structure-activity relationships of adenosine analogs as inhibitors of trypanosomal glyceraldehyde-3-phosphate dehydrogenase. Modifications at positions 5' and 8. Bioorg Med Chem Lett 8:3505-10 (1999)  
Target
Name:
Glyceraldehyde-3-phosphate dehydrogenase
Synonyms:
G3P_HUMAN GAPDH | Glyceraldehyde-3-phosphate dehydrogenase liver
Type:
PROTEIN
Mol. Mass.:
36060.86
Organism:
Homo sapiens (Human)
Description:
ChEMBL_1511315
Residue:
335
  
Inhibitor
Name:
BDBM50366561
Synonyms:
CHEMBL610692
Type:
Small organic molecule
Emp. Form.:
C25H25N7O5
Mol. Mass.:
503.5099
SMILES:
NC(=O)c1ccccc1C(=O)NC[C@H]1OC([C@H](O)[C@@H]1O)n1cnc2c(NCc3ccccc3)ncnc12
: