Target
Glyceraldehyde-3-phosphate dehydrogenase
Ligand
BDBM50366563
Substrate
Meas. Tech.
ChEBML_72905
Ki
3300000±n/a nM
Citation
 Aronov, AMGelb, MH Synthesis and structure-activity relationships of adenosine analogs as inhibitors of trypanosomal glyceraldehyde-3-phosphate dehydrogenase. Modifications at positions 5' and 8. Bioorg Med Chem Lett 8:3505-10 (1999)  
Target
Name:
Glyceraldehyde-3-phosphate dehydrogenase
Synonyms:
G3P_HUMAN GAPDH | Glyceraldehyde-3-phosphate dehydrogenase liver
Type:
PROTEIN
Mol. Mass.:
36060.86
Organism:
Homo sapiens (Human)
Description:
ChEMBL_1511315
Residue:
335
  
Inhibitor
Name:
BDBM50366563
Synonyms:
CHEMBL610982
Type:
Small organic molecule
Emp. Form.:
C17H18N6O4
Mol. Mass.:
370.3626
SMILES:
Nc1ncnc2n(cnc12)C1O[C@H](CNC(=O)c2ccccc2)[C@@H](O)[C@H]1O
: