Target
Sodium-dependent dopamine transporter
Ligand
BDBM50069447
Substrate
Meas. Tech.
ChEBML_61519
Kd
360±n/a nM
Citation
 Carlier, PRLo, MMLo, PCRichelson, ETatsumi, MReynolds, IJSharma, TA Synthesis of a potent wide-spectrum serotonin-, norepinephrine-, dopamine-reuptake inhibitor (SNDRI) and a species-selective dopamine-reuptake inhibitor based on the gamma-amino alcohol functional group. Bioorg Med Chem Lett 8:487-92 (1999)  
Target
Name:
Sodium-dependent dopamine transporter
Synonyms:
DA transporter DAT1 Dopamine transporter protein (DAT) SC6A3_HUMAN Sodium-dependent dopamine transporter Solute carrier family 6 member 3
Type:
Multi-pass membrane protein
Mol. Mass.:
68497.11
Organism:
Homo sapiens (Human)
Description:
Q01959
Residue:
620
  
Inhibitor
Name:
BDBM50069447
Synonyms:
1-(3-(4-(m-Chlorophenyl)-1-piperazinyl)propyl)-3-ethyl-4-(2-phenoxyethyl)-delta2-1,2,4-triazolin-5-one CHEMBL623 US9138393, Nefazodone HCl | US9144538, Nefazodone HCl
Type:
Small organic molecule
Emp. Form.:
C25H32ClN5O2
Mol. Mass.:
470.007
SMILES:
CCc1nn(CCCN2CCN(CC2)c2cccc(Cl)c2)c(=O)n1CCOc1ccccc1
: