Target
Sodium-dependent dopamine transporter
Ligand
BDBM50025691
Substrate
Meas. Tech.
ChEBML_184248
Ki
48000±n/a nM
Citation
 Carlier, PRLo, MMLo, PCRichelson, ETatsumi, MReynolds, IJSharma, TA Synthesis of a potent wide-spectrum serotonin-, norepinephrine-, dopamine-reuptake inhibitor (SNDRI) and a species-selective dopamine-reuptake inhibitor based on the gamma-amino alcohol functional group. Bioorg Med Chem Lett 8:487-92 (1999)  
Target
Name:
Sodium-dependent dopamine transporter
Synonyms:
DA transporter SC6A3_RAT Sodium-dependent dopamine transporter | Sodium-dependent dopamine transporter (DAT)
Type:
Multi-pass membrane protein
Mol. Mass.:
68749.45
Organism:
Rattus norvegicus (rat)
Description:
P23977
Residue:
619
  
Inhibitor
Name:
BDBM50025691
Synonyms:
2-(2-Ethoxy-phenoxymethyl)-morpholine 2-(2-Ethoxy-phenoxymethyl)-morpholine(viloxazine) VILOXAZINE
Type:
Small organic molecule
Emp. Form.:
C13H19NO3
Mol. Mass.:
237.2949
SMILES:
CCOc1ccccc1OCC1CNCCO1
: