Target
Reverse transcriptase/RNaseH
Ligand
BDBM2337
Substrate
Meas. Tech.
ChEBML_195505
IC50
800±n/a nM
Citation
 Mao, CSudbeck, EAVenkatachalam, TKUckun, FM Rational design of N-[2-(2,5-dimethoxyphenylethyl)]-N'-[2-(5-bromopyridyl)]-thiourea (HI-236) as a potent non-nucleoside inhibitor of drug-resistant human immunodeficiency virus. Bioorg Med Chem Lett 9:1593-8 (1999)  
Target
Name:
Reverse transcriptase/RNaseH
Synonyms:
HIV-1 Reverse Transcriptase RNase H Reverse transcriptase/RNaseH
Type:
PROTEIN
Mol. Mass.:
65229.15
Organism:
Human immunodeficiency virus 1
Description:
ChEMBL_1473730
Residue:
566
  
Inhibitor
Name:
BDBM2337
Synonyms:
6-benzyl-1-(ethoxymethyl)-5-(propan-2-yl)-1,2,3,4-tetrahydropyrimidine-2,4-dione Coactinon Emivirine (EMV) I-EBU | MKC-442
Type:
Small organic molecule
Emp. Form.:
C17H22N2O3
Mol. Mass.:
302.3682
SMILES:
CCOCn1c(Cc2ccccc2)c(C(C)C)c(=O)[nH]c1=O
: