Target
Prostaglandin G/H synthase 1
Ligand
BDBM50078683
Substrate
Meas. Tech.
ChEBML_158735
IC50
10000±n/a nM
Citation
 Prasit, PWang, ZBrideau, CChan, CCCharleson, SCromlish, WEthier, DEvans, JFFord-Hutchinson, AWGauthier, JYGordon, RGuay, JGresser, MKargman, SKennedy, BLeblanc, YLéger, SMancini, JO'Neill, GPOuellet, MPercival, MDPerrier, HRiendeau, DRodger, IZamboni, R The discovery of rofecoxib, [MK 966, Vioxx, 4-(4'-methylsulfonylphenyl)-3-phenyl-2(5H)-furanone], an orally active cyclooxygenase-2-inhibitor. Bioorg Med Chem Lett 9:1773-8 (1999)  
Target
Name:
Prostaglandin G/H synthase 1
Synonyms:
COX-1 Cyclooxygenase Cyclooxygenase-1 (COX-1) PTGS1 | Prostaglandin G/H synthase (cyclooxygenase)
Type:
Enzyme
Mol. Mass.:
68692.62
Organism:
Homo sapiens (Human)
Description:
P23219
Residue:
599
  
Inhibitor
Name:
BDBM50078683
Synonyms:
3-(4-Fluoro-phenyl)-4-(4-methanesulfonyl-phenyl)-5H-furan-2-one | CHEMBL51434
Type:
Small organic molecule
Emp. Form.:
C17H13FO4S
Mol. Mass.:
332.346
SMILES:
CS(=O)(=O)c1ccc(cc1)C1=C(C(=O)OC1)c1ccc(F)cc1
: