Target
D(1A) dopamine receptor
Ligand
BDBM50088753
Substrate
Meas. Tech.
ChEBML_59008
Ki
0.260000±n/a nM
Citation
 Tamagnan, GBaldwin, RMKula, NSBaldessarini, RJInnis, RB Cyclopentadienyltricarbonylrheniumbenzazepines: synthesis and binding affinity. Bioorg Med Chem Lett 10:1113-5 (2000)  
Target
Name:
D(1A) dopamine receptor
Synonyms:
DOPAMINE D1 Dopamine D1 high Dopamine receptor Dopamine1-like Drd1a
Type:
Enzyme Catalytic Domain
Mol. Mass.:
49429.75
Organism:
RAT
Description:
P18901
Residue:
446
  
Inhibitor
Name:
BDBM50088753
Synonyms:
5-(3-Bromo-phenyl)-8-chloro-3-methyl-2,3,4,5-tetrahydro-1H-benzo[d]azepin-7-ol SCH-23390
Type:
Small organic molecule
Emp. Form.:
C17H17BrClNO
Mol. Mass.:
366.68
SMILES:
CN1CCc2cc(Cl)c(O)cc2C(C1)c1cccc(Br)c1
: