Target
Adenosine transporter 1
Ligand
BDBM50421414
Substrate
Meas. Tech.
ChEBML_31141
Ki
22900±n/a nM
Citation
 Soulère, LHoffmann, PBringaud, FPérié, J Synthesis and uptake of nitric oxide-releasing drugs by the P2 nucleoside transporter in Trypanosoma equiperdum. Bioorg Med Chem Lett 10:1347-50 (2000)  
Target
Name:
Adenosine transporter 1
Synonyms:
Type:
PROTEIN
Mol. Mass.:
51044.02
Organism:
Trypanosoma brucei
Description:
ChEMBL_31141
Residue:
463
  
Inhibitor
Name:
BDBM50421414
Synonyms:
CYMELARSEN | Cymelarsan
Type:
Small organic molecule
Emp. Form.:
C13H21AsN8S2
Mol. Mass.:
428.411
SMILES:
NCCS[As](SCCN)c1ccc(Nc2nc(N)nc(N)n2)cc1
: