Target
Sodium-dependent serotonin transporter
Ligand
BDBM50090215
Substrate
Meas. Tech.
ChEBML_201983
Ki
1.9±n/a nM
Citation
 Lee, BSChu, SLee, BCChi, DYChoe, YSJeong, KJJin, C Syntheses and binding affinities of 6-nitroquipazine analogues for serotonin transporter. Part 1. Bioorg Med Chem Lett 10:1559-62 (2000)  
Target
Name:
Sodium-dependent serotonin transporter
Synonyms:
5-HT Transporter 5HT transporter Anandamid membrane transporter, AMT Monoamine transporters; Norepinephrine & serotonin Slc6a4 Sodium-dependent serotonin transporter (SERT) | imipramine receptor
Type:
Multi-pass membrane protein
Mol. Mass.:
70168.43
Organism:
Rattus norvegicus (rat)
Description:
P31652
Residue:
630
  
Inhibitor
Name:
BDBM50090215
Synonyms:
2-[1,4]Diazepan-1-yl-6-nitro-quinoline | CHEMBL43139
Type:
Small organic molecule
Emp. Form.:
C14H16N4O2
Mol. Mass.:
272.3024
SMILES:
[O-][N+](=O)c1ccc2nc(ccc2c1)N1CCCNCC1
: