Target
Pancreatic alpha-amylase
Ligand
BDBM50451094
Substrate
Meas. Tech.
ChEBML_34101
IC50
62500±n/a nM
Citation
 Gerrard, JAPrince, MJAbell, AD Kinetic characterisation of ene-diol-based inhibitors of alpha-amylase. Bioorg Med Chem Lett 10:1575-6 (2000)  
Target
Name:
Pancreatic alpha-amylase
Synonyms:
1,4-alpha-D-glucan glucanohydrolase Amy2 | PA
Type:
PROTEIN
Mol. Mass.:
57186.64
Organism:
Rattus norvegicus
Description:
ChEMBL_34101
Residue:
508
  
Inhibitor
Name:
BDBM50451094
Synonyms:
Ascorbyl Palmitate E304
Type:
Small organic molecule
Emp. Form.:
C22H38O7
Mol. Mass.:
414.5329
SMILES:
[H][C@@]1(OC(=O)C(O)=C1O)[C@@H](O)COC(=O)CCCCCCCCCCCCCCC
: