Target
E-selectin
Ligand
BDBM50450369
Substrate
Meas. Tech.
ChEBML_199852
IC50
600000±n/a nM
Citation
 Kurokawa, KKumihara, HKondo, H A solid-phase synthesis for beta-turn mimetics of sialyl Lewis X. Bioorg Med Chem Lett 10:1827-30 (2000)  
Target
Name:
E-selectin
Synonyms:
ELAM1 SELE Selectin E
Type:
PROTEIN
Mol. Mass.:
66642.96
Organism:
Homo sapiens (Human)
Description:
ChEMBL_1438995
Residue:
610
  
Inhibitor
Name:
BDBM50450369
Synonyms:
SIALYL LEWIS X Sialyl lewis-x sialyl LewisX
Type:
Small organic molecule
Emp. Form.:
C31H52N2O23
Mol. Mass.:
820.7442
SMILES:
[H][C@]1(O[C@@](C[C@H](O)[C@H]1NC(C)=O)(O[C@H]1[C@@H](O)[C@@H](CO)O[C@@H](O[C@H]([C@H](O)CO)[C@H](O[C@@H]2O[C@@H](C)[C@@H](O)[C@@H](O)[C@@H]2O)[C@@H](NC(C)=O)C=O)[C@@H]1O)C(O)=O)[C@H](O)[C@H](O)CO
: