Target
P-selectin
Ligand
BDBM50091501
Substrate
Meas. Tech.
ChEBML_200026
IC50
2570±n/a nM
Citation
 Kurokawa, KKumihara, HKondo, H A solid-phase synthesis for beta-turn mimetics of sialyl Lewis X. Bioorg Med Chem Lett 10:1827-30 (2000)  
Target
Name:
P-selectin
Synonyms:
GMRP LYAM3_HUMAN P-selectin/P-selectin glycoprotein ligand 1 | SELP
Type:
PROTEIN
Mol. Mass.:
90834.61
Organism:
Homo sapiens (Human)
Description:
ChEMBL_1438999
Residue:
830
  
Inhibitor
Name:
BDBM50091501
Synonyms:
3-[(2S,5R)-3,6-Dioxo-7-(2-tetradecyl-hexadecyl)-5-(3,4,5-trihydroxy-6-hydroxymethyl-tetrahydro-pyran-2-yloxymethyl)-[1,4,7]thiadiazecan-2-yl]-propionic acid | CHEMBL3215517
Type:
Small organic molecule
Emp. Form.:
C47H88N2O10S
Mol. Mass.:
873.274
SMILES:
CCCCCCCCCCCCCCC(CCCCCCCCCCCCCC)CN1CCCS[C@@H](CCC(O)=O)C(=O)N[C@H](CO[C@H]2O[C@H](CO)[C@@H](O)[C@@H](O)[C@@H]2O)C1=O
: