Target
E-selectin
Ligand
BDBM50091501
Substrate
Meas. Tech.
ChEBML_199852
IC50
>100000±n/a nM
Citation
 Kurokawa, KKumihara, HKondo, H A solid-phase synthesis for beta-turn mimetics of sialyl Lewis X. Bioorg Med Chem Lett 10:1827-30 (2000)  
Target
Name:
E-selectin
Synonyms:
ELAM1 SELE Selectin E
Type:
PROTEIN
Mol. Mass.:
66642.96
Organism:
Homo sapiens (Human)
Description:
ChEMBL_1438995
Residue:
610
  
Inhibitor
Name:
BDBM50091501
Synonyms:
3-[(2S,5R)-3,6-Dioxo-7-(2-tetradecyl-hexadecyl)-5-(3,4,5-trihydroxy-6-hydroxymethyl-tetrahydro-pyran-2-yloxymethyl)-[1,4,7]thiadiazecan-2-yl]-propionic acid | CHEMBL3215517
Type:
Small organic molecule
Emp. Form.:
C47H88N2O10S
Mol. Mass.:
873.274
SMILES:
CCCCCCCCCCCCCCC(CCCCCCCCCCCCCC)CN1CCCS[C@@H](CCC(O)=O)C(=O)N[C@H](CO[C@H]2O[C@H](CO)[C@@H](O)[C@@H](O)[C@@H]2O)C1=O
: