Target
L-selectin
Ligand
BDBM50091501
Substrate
Meas. Tech.
ChEBML_199997
IC50
2340±n/a nM
Citation
 Kurokawa, KKumihara, HKondo, H A solid-phase synthesis for beta-turn mimetics of sialyl Lewis X. Bioorg Med Chem Lett 10:1827-30 (2000)  
Target
Name:
L-selectin
Synonyms:
LNHR LYAM1_HUMAN SELL | Selectin
Type:
PROTEIN
Mol. Mass.:
42187.20
Organism:
Homo sapiens (Human)
Description:
ChEMBL_200000
Residue:
372
  
Inhibitor
Name:
BDBM50091501
Synonyms:
3-[(2S,5R)-3,6-Dioxo-7-(2-tetradecyl-hexadecyl)-5-(3,4,5-trihydroxy-6-hydroxymethyl-tetrahydro-pyran-2-yloxymethyl)-[1,4,7]thiadiazecan-2-yl]-propionic acid | CHEMBL3215517
Type:
Small organic molecule
Emp. Form.:
C47H88N2O10S
Mol. Mass.:
873.274
SMILES:
CCCCCCCCCCCCCCC(CCCCCCCCCCCCCC)CN1CCCS[C@@H](CCC(O)=O)C(=O)N[C@H](CO[C@H]2O[C@H](CO)[C@@H](O)[C@@H](O)[C@@H]2O)C1=O
: