Target
L-selectin
Ligand
BDBM50091500
Substrate
Meas. Tech.
ChEBML_199997
IC50
4000±n/a nM
Citation
 Kurokawa, KKumihara, HKondo, H A solid-phase synthesis for beta-turn mimetics of sialyl Lewis X. Bioorg Med Chem Lett 10:1827-30 (2000)  
Target
Name:
L-selectin
Synonyms:
LNHR LYAM1_HUMAN SELL | Selectin
Type:
PROTEIN
Mol. Mass.:
42187.20
Organism:
Homo sapiens (Human)
Description:
ChEMBL_200000
Residue:
372
  
Inhibitor
Name:
BDBM50091500
Synonyms:
(R)-4-Methylcarbamoyl-4-[(S)-2-(2-tetradecyl-hexadecanoylamino)-3-(3,4,5-trihydroxy-6-hydroxymethyl-tetrahydro-pyran-2-yloxy)-propionylamino]-butyric acid | CHEMBL3215516
Type:
Small organic molecule
Emp. Form.:
C45H85N3O11
Mol. Mass.:
844.1699
SMILES:
CCCCCCCCCCCCCCC(CCCCCCCCCCCCCC)C(=O)N[C@@H](CO[C@@H]1O[C@@H](CO)[C@H](O)[C@H](O)[C@H]1O)C(=O)N[C@H](CCC(O)=O)C(=O)NC
: