Target
Trypanothione reductase
Ligand
BDBM50093210
Substrate
Meas. Tech.
ChEBML_211803
Ki
350±n/a nM
Citation
 Chitkul, BBradley, M Optimising inhibitors of trypanothione reductase using solid-phase chemistry. Bioorg Med Chem Lett 10:2367-9 (2001)  
Target
Name:
Trypanothione reductase
Synonyms:
N(1),N(8)-bis(glutathionyl)spermidine reductase TR | TYTR_TRYCR
Type:
Homodimer; oxidoreductase
Mol. Mass.:
53868.26
Organism:
Trypanosoma cruzi
Description:
Residue:
492
  
Inhibitor
Name:
BDBM50093210
Synonyms:
3-(1H-Indol-3-yl)-N-(3-{4-[3-(2-1H-indol-3-yl-acetylamino)-propylamino]-butylamino}-propyl)-propionamide | CHEMBL76523
Type:
Small organic molecule
Emp. Form.:
C31H42N6O2
Mol. Mass.:
530.7042
SMILES:
O=C(CCc1c[nH]c2ccccc12)NCCCNCCCCNCCCNC(=O)Cc1c[nH]c2ccccc12
: