Target
5-hydroxytryptamine receptor 1A
Ligand
BDBM50218395
Substrate
Meas. Tech.
ChEMBL_1456 (CHEMBL616579)
Ki
1.1±n/a nM
Citation
 Fujio, MKuroita, TSakai, YNakagawa, HMatsumoto, Y N-[1-(2-Phenylethyl)pyrrolidin-3-yl]-1-adamantanecarboxamides as novel 5-HT2 receptor antagonists. Bioorg Med Chem Lett 10:2457-61 (2001)  
Target
Name:
5-hydroxytryptamine receptor 1A
Synonyms:
5-HT-1A 5-HT1A 5-hydroxytryptamine receptor 1A (5HT1A) 5ht1a Htr1a Serotonin 1a (5-HT1a) receptor/Adrenergic receptor alpha-1 | Serotonin receptor 1A
Type:
G Protein-Coupled Receptor (GPCR)
Mol. Mass.:
46445.29
Organism:
Rattus norvegicus (rat)
Description:
Binding assays were performed using rat hippocampal membranes.
Residue:
422
  
Inhibitor
Name:
BDBM50218395
Synonyms:
CHEMBL311095
Type:
Small organic molecule
Emp. Form.:
C25H36N2O
Mol. Mass.:
380.5661
SMILES:
O=C(NC1CCN(CCCCc2ccccc2)C1)C12CC3CC(CC(C3)C1)C2
: