Target
5-hydroxytryptamine receptor 1A
Ligand
BDBM50218400
Substrate
Meas. Tech.
ChEMBL_1456 (CHEMBL616579)
Ki
0.530000±n/a nM
Citation
 Fujio, MKuroita, TSakai, YNakagawa, HMatsumoto, Y N-[1-(2-Phenylethyl)pyrrolidin-3-yl]-1-adamantanecarboxamides as novel 5-HT2 receptor antagonists. Bioorg Med Chem Lett 10:2457-61 (2001)  
Target
Name:
5-hydroxytryptamine receptor 1A
Synonyms:
5-HT-1A 5-HT1A 5-hydroxytryptamine receptor 1A (5HT1A) 5ht1a Htr1a Serotonin 1a (5-HT1a) receptor/Adrenergic receptor alpha-1 | Serotonin receptor 1A
Type:
G Protein-Coupled Receptor (GPCR)
Mol. Mass.:
46445.29
Organism:
Rattus norvegicus (rat)
Description:
Binding assays were performed using rat hippocampal membranes.
Residue:
422
  
Inhibitor
Name:
BDBM50218400
Synonyms:
CHEMBL1907669
Type:
Small organic molecule
Emp. Form.:
C23H31FN2O
Mol. Mass.:
370.5034
SMILES:
[H][C@]1(CCN(CCc2ccc(F)cc2)C1)NC(=O)C12CC3([H])CC([H])(CC([H])(C3)C1)C2
: