Target
Neutrophil collagenase
Ligand
BDBM50100086
Substrate
Meas. Tech.
ChEBML_105212
IC50
3000±n/a nM
Citation
 Baxter, ADBhogal, RBird, JKeily, JFManallack, DTMontana, JGOwen, DAPitt, WRWatson, RJWills, RE Arylsulphonyl hydroxamic acids: potent and selective matrix metalloproteinase inhibitors. Bioorg Med Chem Lett 11:1465-8 (2001)  
Target
Name:
Neutrophil collagenase
Synonyms:
CLG1 MMP8 Matrix metalloproteinase-8 PMNL collagenase | PMNL-CL
Type:
Enzyme
Mol. Mass.:
53413.48
Organism:
Homo sapiens (Human)
Description:
P22894
Residue:
467
  
Inhibitor
Name:
BDBM50100086
Synonyms:
CHEMBL33977 | [2,6-Dimethyl-4-(3-methyl-4-oxo-3,4-dihydro-phthalazin-1-yl)-phenoxy]-acetic acid methyl ester
Type:
Small organic molecule
Emp. Form.:
C20H20N2O4
Mol. Mass.:
352.3838
SMILES:
COC(=O)COc1c(C)cc(cc1C)-c1nn(C)c(=O)c2ccccc12
: