Target
72 kDa type IV collagenase
Ligand
BDBM50100090
Substrate
Meas. Tech.
ChEBML_104559
IC50
50±n/a nM
Citation
 Baxter, ADBhogal, RBird, JKeily, JFManallack, DTMontana, JGOwen, DAPitt, WRWatson, RJWills, RE Arylsulphonyl hydroxamic acids: potent and selective matrix metalloproteinase inhibitors. Bioorg Med Chem Lett 11:1465-8 (2001)  
Target
Name:
72 kDa type IV collagenase
Synonyms:
72 kDa gelatinase CLG4A Gelatinase A (MMP-2) MMP2_HUMAN Matrix metalloproteinase-2 (MMP 2) Matrix metalloproteinases 2 (MMP-2) | TBE-1
Type:
Enzyme
Mol. Mass.:
73870.36
Organism:
Homo sapiens (Human)
Description:
P08253
Residue:
660
  
Inhibitor
Name:
BDBM50100090
Synonyms:
2-[4-(1-Oxy-pyridine-4-carbonyl)-benzenesulfonylmethyl]-5-phenyl-pentanoic acid hydroxyamide | CHEMBL288099
Type:
Small organic molecule
Emp. Form.:
C24H24N2O6S
Mol. Mass.:
468.522
SMILES:
ONC(=O)C(CCCc1ccccc1)CS(=O)(=O)c1ccc(cc1)C(=O)c1cc[n+]([O-])cc1
: