Target
Matrix metalloproteinase-9
Ligand
BDBM50100088
Substrate
Meas. Tech.
ChEBML_105531
IC50
2500±n/a nM
Citation
 Baxter, ADBhogal, RBird, JKeily, JFManallack, DTMontana, JGOwen, DAPitt, WRWatson, RJWills, RE Arylsulphonyl hydroxamic acids: potent and selective matrix metalloproteinase inhibitors. Bioorg Med Chem Lett 11:1465-8 (2001)  
Target
Name:
Matrix metalloproteinase-9
Synonyms:
67 kDa matrix metalloproteinase-9 92 kDa gelatinase CLG4B Gelatinase B MMP9 Matrix metalloproteinase 9 (MMP-9) Matrix metalloproteinase-9 (MMP9)
Type:
Enzyme
Mol. Mass.:
78452.28
Organism:
Homo sapiens (Human)
Description:
P14780
Residue:
707
  
Inhibitor
Name:
BDBM50100088
Synonyms:
2-[4-(Hydroxy-phenyl-methyl)-benzenesulfonylmethyl]-5-phenyl-pentanoic acid hydroxyamide | CHEMBL33915
Type:
Small organic molecule
Emp. Form.:
C25H27NO5S
Mol. Mass.:
453.551
SMILES:
ONC(=O)C(CCCc1ccccc1)CS(=O)(=O)c1ccc(cc1)C(O)c1ccccc1
: