Target
Stromelysin-1
Ligand
BDBM50100087
Substrate
Meas. Tech.
ChEBML_104899
IC50
100±n/a nM
Citation
 Baxter, ADBhogal, RBird, JKeily, JFManallack, DTMontana, JGOwen, DAPitt, WRWatson, RJWills, RE Arylsulphonyl hydroxamic acids: potent and selective matrix metalloproteinase inhibitors. Bioorg Med Chem Lett 11:1465-8 (2001)  
Target
Name:
Stromelysin-1
Synonyms:
MMP-3 MMP3_HUMAN Matrix metalloproteinase 3 Matrix metalloproteinase-3 (MMP-3) SL-1 Stromelysin 1 | Transin-1
Type:
Enzyme
Mol. Mass.:
53973.13
Organism:
Homo sapiens (Human)
Description:
P08254
Residue:
477
  
Inhibitor
Name:
BDBM50100087
Synonyms:
5-Phenyl-2-[4-(pyridine-4-carbonyl)-benzenesulfonylmethyl]-pentanoic acid hydroxyamide; hydrochloride | CHEMBL542088
Type:
Small organic molecule
Emp. Form.:
C24H24N2O5S
Mol. Mass.:
452.523
SMILES:
ONC(=O)C(CCCc1ccccc1)CS(=O)(=O)c1ccc(cc1)C(=O)c1ccncc1
: