Target
72 kDa type IV collagenase
Ligand
BDBM50100087
Substrate
Meas. Tech.
ChEBML_104559
IC50
3±n/a nM
Citation
 Baxter, ADBhogal, RBird, JKeily, JFManallack, DTMontana, JGOwen, DAPitt, WRWatson, RJWills, RE Arylsulphonyl hydroxamic acids: potent and selective matrix metalloproteinase inhibitors. Bioorg Med Chem Lett 11:1465-8 (2001)  
Target
Name:
72 kDa type IV collagenase
Synonyms:
72 kDa gelatinase CLG4A Gelatinase A (MMP-2) MMP2_HUMAN Matrix metalloproteinase-2 (MMP 2) Matrix metalloproteinases 2 (MMP-2) | TBE-1
Type:
Enzyme
Mol. Mass.:
73870.36
Organism:
Homo sapiens (Human)
Description:
P08253
Residue:
660
  
Inhibitor
Name:
BDBM50100087
Synonyms:
5-Phenyl-2-[4-(pyridine-4-carbonyl)-benzenesulfonylmethyl]-pentanoic acid hydroxyamide; hydrochloride | CHEMBL542088
Type:
Small organic molecule
Emp. Form.:
C24H24N2O5S
Mol. Mass.:
452.523
SMILES:
ONC(=O)C(CCCc1ccccc1)CS(=O)(=O)c1ccc(cc1)C(=O)c1ccncc1
: