Target
Neutrophil collagenase
Ligand
BDBM50100091
Substrate
Meas. Tech.
ChEBML_105212
IC50
300±n/a nM
Citation
 Baxter, ADBhogal, RBird, JKeily, JFManallack, DTMontana, JGOwen, DAPitt, WRWatson, RJWills, RE Arylsulphonyl hydroxamic acids: potent and selective matrix metalloproteinase inhibitors. Bioorg Med Chem Lett 11:1465-8 (2001)  
Target
Name:
Neutrophil collagenase
Synonyms:
CLG1 MMP8 Matrix metalloproteinase-8 PMNL collagenase | PMNL-CL
Type:
Enzyme
Mol. Mass.:
53413.48
Organism:
Homo sapiens (Human)
Description:
P22894
Residue:
467
  
Inhibitor
Name:
BDBM50100091
Synonyms:
2-(4-Benzoyl-benzenesulfonylmethyl)-5-phenyl-pentanoic acid | CHEMBL35476
Type:
Small organic molecule
Emp. Form.:
C25H24O5S
Mol. Mass.:
436.52
SMILES:
OC(=O)C(CCCc1ccccc1)CS(=O)(=O)c1ccc(cc1)C(=O)c1ccccc1
: