Target
Interstitial collagenase
Ligand
BDBM50100086
Substrate
Meas. Tech.
ChEBML_106309
IC50
7000±n/a nM
Citation
 Baxter, ADBhogal, RBird, JKeily, JFManallack, DTMontana, JGOwen, DAPitt, WRWatson, RJWills, RE Arylsulphonyl hydroxamic acids: potent and selective matrix metalloproteinase inhibitors. Bioorg Med Chem Lett 11:1465-8 (2001)  
Target
Name:
Interstitial collagenase
Synonyms:
CLG MMP1 Matrix metalloproteinase-1 | Matrix metalloproteinase-1 (MMP-1)
Type:
Enzyme
Mol. Mass.:
54010.26
Organism:
Homo sapiens (Human)
Description:
P03956
Residue:
469
  
Inhibitor
Name:
BDBM50100086
Synonyms:
CHEMBL33977 | [2,6-Dimethyl-4-(3-methyl-4-oxo-3,4-dihydro-phthalazin-1-yl)-phenoxy]-acetic acid methyl ester
Type:
Small organic molecule
Emp. Form.:
C20H20N2O4
Mol. Mass.:
352.3838
SMILES:
COC(=O)COc1c(C)cc(cc1C)-c1nn(C)c(=O)c2ccccc12
: