Target
Interstitial collagenase
Ligand
BDBM50100088
Substrate
Meas. Tech.
ChEBML_106309
IC50
25000±n/a nM
Citation
 Baxter, ADBhogal, RBird, JKeily, JFManallack, DTMontana, JGOwen, DAPitt, WRWatson, RJWills, RE Arylsulphonyl hydroxamic acids: potent and selective matrix metalloproteinase inhibitors. Bioorg Med Chem Lett 11:1465-8 (2001)  
Target
Name:
Interstitial collagenase
Synonyms:
CLG MMP1 Matrix metalloproteinase-1 | Matrix metalloproteinase-1 (MMP-1)
Type:
Enzyme
Mol. Mass.:
54010.26
Organism:
Homo sapiens (Human)
Description:
P03956
Residue:
469
  
Inhibitor
Name:
BDBM50100088
Synonyms:
2-[4-(Hydroxy-phenyl-methyl)-benzenesulfonylmethyl]-5-phenyl-pentanoic acid hydroxyamide | CHEMBL33915
Type:
Small organic molecule
Emp. Form.:
C25H27NO5S
Mol. Mass.:
453.551
SMILES:
ONC(=O)C(CCCc1ccccc1)CS(=O)(=O)c1ccc(cc1)C(O)c1ccccc1
: