Target
Stromelysin-1
Ligand
BDBM50100092
Substrate
Meas. Tech.
ChEBML_104899
IC50
>2000±n/a nM
Citation
 Baxter, ADBhogal, RBird, JKeily, JFManallack, DTMontana, JGOwen, DAPitt, WRWatson, RJWills, RE Arylsulphonyl hydroxamic acids: potent and selective matrix metalloproteinase inhibitors. Bioorg Med Chem Lett 11:1465-8 (2001)  
Target
Name:
Stromelysin-1
Synonyms:
MMP-3 MMP3_HUMAN Matrix metalloproteinase 3 Matrix metalloproteinase-3 (MMP-3) SL-1 Stromelysin 1 | Transin-1
Type:
Enzyme
Mol. Mass.:
53973.13
Organism:
Homo sapiens (Human)
Description:
P08254
Residue:
477
  
Inhibitor
Name:
BDBM50100092
Synonyms:
2-(4-Benzyl-benzenesulfonylmethyl)-5-phenyl-pentanoic acid hydroxyamide | CHEMBL34353
Type:
Small organic molecule
Emp. Form.:
C25H27NO4S
Mol. Mass.:
437.551
SMILES:
ONC(=O)C(CCCc1ccccc1)CS(=O)(=O)c1ccc(Cc2ccccc2)cc1
: