Target
Carbonic anhydrase 1
Ligand
BDBM50101360
Substrate
Meas. Tech.
ChEBML_47505
Ki
38±n/a nM
Citation
 Mincione, FStarnotti, MMenabuoni, LScozzafava, ACasini, ASupuran, CT Carbonic anhydrase inhibitors: 4-sulfamoyl-benzenecarboxamides and 4-chloro-3-sulfamoyl-benzenecarboxamides with strong topical antiglaucoma properties. Bioorg Med Chem Lett 11:1787-91 (2001)  
Target
Name:
Carbonic anhydrase 1
Synonyms:
CA-I CAB Carbonate dehydratase I Carbonic anhydrase 1 (CA I) Carbonic anhydrase 1 (Recombinant CA I) Carbonic anhydrase B Carbonic anhydrase I (CA I) Carbonic anhydrase I (CAI) Carbonic anhydrase isoenzyme I (hCA I) | hCA
Type:
Enzyme
Mol. Mass.:
28873.37
Organism:
Homo sapiens (Human)
Description:
P00915
Residue:
261
  
Inhibitor
Name:
BDBM50101360
Synonyms:
4-Sulfamoyl-N-(4-sulfamoyl-phenyl)-benzamide | CHEMBL54235
Type:
Small organic molecule
Emp. Form.:
C13H13N3O5S2
Mol. Mass.:
355.389
SMILES:
NS(=O)(=O)c1ccc(NC(=O)c2ccc(cc2)S(N)(=O)=O)cc1
: