Target
Carbonic anhydrase 1
Ligand
BDBM50101382
Substrate
Meas. Tech.
ChEBML_47505
Ki
27±n/a nM
Citation
 Mincione, FStarnotti, MMenabuoni, LScozzafava, ACasini, ASupuran, CT Carbonic anhydrase inhibitors: 4-sulfamoyl-benzenecarboxamides and 4-chloro-3-sulfamoyl-benzenecarboxamides with strong topical antiglaucoma properties. Bioorg Med Chem Lett 11:1787-91 (2001)  
Target
Name:
Carbonic anhydrase 1
Synonyms:
CA-I CAB Carbonate dehydratase I Carbonic anhydrase 1 (CA I) Carbonic anhydrase 1 (Recombinant CA I) Carbonic anhydrase B Carbonic anhydrase I (CA I) Carbonic anhydrase I (CAI) Carbonic anhydrase isoenzyme I (hCA I) | hCA
Type:
Enzyme
Mol. Mass.:
28873.37
Organism:
Homo sapiens (Human)
Description:
P00915
Residue:
261
  
Inhibitor
Name:
BDBM50101382
Synonyms:
(S)-2-[(S)-2-(4-Chloro-3-sulfamoyl-benzoylamino)-3-(3H-imidazol-4-yl)-propionylamino]-3-phenyl-propionic acid | CHEMBL52550
Type:
Small organic molecule
Emp. Form.:
C22H22ClN5O6S
Mol. Mass.:
519.958
SMILES:
NS(=O)(=O)c1cc(ccc1Cl)C(=O)N[C@@H](Cc1cnc[nH]1)C(=O)N[C@@H](Cc1ccccc1)C(O)=O
: