Target
Carbonic anhydrase 4
Ligand
BDBM50101340
Substrate
Meas. Tech.
ChEBML_45271
Ki
15±n/a nM
Citation
 Mincione, FStarnotti, MMenabuoni, LScozzafava, ACasini, ASupuran, CT Carbonic anhydrase inhibitors: 4-sulfamoyl-benzenecarboxamides and 4-chloro-3-sulfamoyl-benzenecarboxamides with strong topical antiglaucoma properties. Bioorg Med Chem Lett 11:1787-91 (2001)  
Target
Name:
Carbonic anhydrase 4
Synonyms:
CA-IV CAH4_BOVIN Carbonic Anhydrase IV Carbonic anhydrase 4
Type:
Enzyme
Mol. Mass.:
35152.74
Organism:
Bos taurus (bovine)
Description:
Bovine isozyme, isolated from lung microsomes
Residue:
312
  
Inhibitor
Name:
BDBM50101340
Synonyms:
4-Sulfamoyl-N-(5-sulfamoyl-[1,3,4]thiadiazol-2-yl)-benzamide | CHEMBL48292
Type:
Small organic molecule
Emp. Form.:
C9H9N5O5S3
Mol. Mass.:
363.393
SMILES:
NS(=O)(=O)c1nnc(NC(=O)c2ccc(cc2)S(N)(=O)=O)s1
: