Target
Interstitial collagenase
Ligand
BDBM50103160
Substrate
Meas. Tech.
ChEBML_106310
IC50
124±n/a nM
Citation
 Levin, JIChen, JDu, MHogan, MKincaid, SNelson, FCVenkatesan, AMWehr, TZask, ADiJoseph, JKillar, LMSkala, SSung, ASharr, MRoth, CJin, GCowling, RMohler, KMBlack, RAMarch, CJSkotnicki, JS The discovery of anthranilic acid-based MMP inhibitors. Part 2: SAR of the 5-position and P1(1) groups. Bioorg Med Chem Lett 11:2189-92 (2001)  
Target
Name:
Interstitial collagenase
Synonyms:
CLG MMP1 Matrix metalloproteinase-1 | Matrix metalloproteinase-1 (MMP-1)
Type:
Enzyme
Mol. Mass.:
54010.26
Organism:
Homo sapiens (Human)
Description:
P03956
Residue:
469
  
Inhibitor
Name:
BDBM50103160
Synonyms:
5-Bromo-N-hydroxy-2-[(4-methoxy-benzenesulfonyl)-pyridin-3-ylmethyl-amino]-3-methyl-benzamide | CHEMBL71725
Type:
Small organic molecule
Emp. Form.:
C21H20BrN3O5S
Mol. Mass.:
506.37
SMILES:
COc1ccc(cc1)S(=O)(=O)N(Cc1cccnc1)c1c(C)cc(Br)cc1C(=O)NO
: