Target
Disintegrin and metalloproteinase domain-containing protein 17
Ligand
BDBM50103161
Substrate
Meas. Tech.
ChEBML_207330
IC50
61±n/a nM
Citation
 Levin, JIChen, JDu, MHogan, MKincaid, SNelson, FCVenkatesan, AMWehr, TZask, ADiJoseph, JKillar, LMSkala, SSung, ASharr, MRoth, CJin, GCowling, RMohler, KMBlack, RAMarch, CJSkotnicki, JS The discovery of anthranilic acid-based MMP inhibitors. Part 2: SAR of the 5-position and P1(1) groups. Bioorg Med Chem Lett 11:2189-92 (2001)  
Target
Name:
Disintegrin and metalloproteinase domain-containing protein 17
Synonyms:
ADA17_HUMAN CSVP Disintegrin and metalloproteinase domain-containing protein 17 (ADAM17) TNF-alpha convertase TNF-alpha-converting enzyme (TACE) Tumor necrosis factor-α converting enzyme (TACE)
Type:
Enzyme
Mol. Mass.:
93007.89
Organism:
Homo sapiens (Human)
Description:
Residue:
824
  
Inhibitor
Name:
BDBM50103161
Synonyms:
3-Furan-2-yl-N-hydroxy-2-[(4-methoxy-benzenesulfonyl)-pyridin-3-ylmethyl-amino]-5-methyl-benzamide | CHEMBL69268
Type:
Small organic molecule
Emp. Form.:
C25H23N3O6S
Mol. Mass.:
493.532
SMILES:
COc1ccc(cc1)S(=O)(=O)N(Cc1cccnc1)c1c(cc(C)cc1-c1ccco1)C(=O)NO
: