Target
D(2) dopamine receptor
Ligand
BDBM50104343
Substrate
Meas. Tech.
ChEMBL_58635 (CHEMBL665385)
Ki
330±n/a nM
Citation
 Einsiedel, JHübner, HGmeiner, P Benzamide bioisosteres incorporating dihydroheteroazole substructures: EPC synthesis and SAR leading to a selective dopamine D4 receptor partial agonist (FAUC 179). Bioorg Med Chem Lett 11:2533-6 (2001)  
Target
Name:
D(2) dopamine receptor
Synonyms:
D(2) dopamine receptor DOPAMINE D2 Long DRD2 Dopamine D2 receptor Dopamine D2 receptor (D2R) Dopamine2-like | d2
Type:
Cell-surface receptors
Mol. Mass.:
50647.10
Organism:
Homo sapiens (Human)
Description:
P14416
Residue:
443
  
Inhibitor
Name:
BDBM50104343
Synonyms:
1-Phenyl-4-((S)-2-phenyl-4,5-dihydro-oxazol-4-ylmethyl)-piperazine | CHEMBL86060
Type:
Small organic molecule
Emp. Form.:
C20H23N3O
Mol. Mass.:
321.4161
SMILES:
C([C@H]1COC(=N1)c1ccccc1)N1CCN(CC1)c1ccccc1
: