Target
D(2) dopamine receptor
Ligand
BDBM50104345
Substrate
Meas. Tech.
ChEMBL_58320 (CHEMBL671178)
Ki
820±n/a nM
Citation
 Einsiedel, JHübner, HGmeiner, P Benzamide bioisosteres incorporating dihydroheteroazole substructures: EPC synthesis and SAR leading to a selective dopamine D4 receptor partial agonist (FAUC 179). Bioorg Med Chem Lett 11:2533-6 (2001)  
Target
Name:
D(2) dopamine receptor
Synonyms:
D(2) dopamine receptor DOPAMINE D2 Long DRD2 Dopamine D2 receptor Dopamine D2 receptor (D2R) Dopamine2-like | d2
Type:
Cell-surface receptors
Mol. Mass.:
50647.10
Organism:
Homo sapiens (Human)
Description:
P14416
Residue:
443
  
Inhibitor
Name:
BDBM50104345
Synonyms:
1-((4S,5S)-5-Methyl-2-phenyl-4,5-dihydro-oxazol-4-ylmethyl)-4-phenyl-piperazine | CHEMBL83306
Type:
Small organic molecule
Emp. Form.:
C21H25N3O
Mol. Mass.:
335.4427
SMILES:
C[C@@H]1OC(=N[C@H]1CN1CCN(CC1)c1ccccc1)c1ccccc1
: