Target
D(4) dopamine receptor
Ligand
BDBM50104346
Substrate
Meas. Tech.
ChEMBL_60815 (CHEMBL674967)
Ki
1200±n/a nM
Citation
 Einsiedel, JHübner, HGmeiner, P Benzamide bioisosteres incorporating dihydroheteroazole substructures: EPC synthesis and SAR leading to a selective dopamine D4 receptor partial agonist (FAUC 179). Bioorg Med Chem Lett 11:2533-6 (2001)  
Target
Name:
D(4) dopamine receptor
Synonyms:
D(2C) dopamine receptor DOPAMINE D4.2 DRD4 Dopamine D4 receptor
Type:
Enzyme
Mol. Mass.:
48373.19
Organism:
Homo sapiens (Human)
Description:
P21917
Residue:
419
  
Inhibitor
Name:
BDBM50104346
Synonyms:
1-Phenyl-4-((S)-2-phenyl-4,5-dihydro-thiazol-4-ylmethyl)-piperazine | CHEMBL82527
Type:
Small organic molecule
Emp. Form.:
C20H23N3S
Mol. Mass.:
337.482
SMILES:
C([C@H]1CSC(=N1)c1ccccc1)N1CCN(CC1)c1ccccc1
: