Target
D(4) dopamine receptor
Ligand
BDBM50104341
Substrate
Meas. Tech.
ChEMBL_60818 (CHEMBL673420)
Ki
51±n/a nM
Citation
 Einsiedel, JHübner, HGmeiner, P Benzamide bioisosteres incorporating dihydroheteroazole substructures: EPC synthesis and SAR leading to a selective dopamine D4 receptor partial agonist (FAUC 179). Bioorg Med Chem Lett 11:2533-6 (2001)  
Target
Name:
D(4) dopamine receptor
Synonyms:
D(2C) dopamine receptor DOPAMINE D4.2 DRD4 Dopamine D4 receptor
Type:
Enzyme
Mol. Mass.:
48373.19
Organism:
Homo sapiens (Human)
Description:
P21917
Residue:
419
  
Inhibitor
Name:
BDBM50104341
Synonyms:
1-Phenyl-4-((R)-2-phenyl-4,5-dihydro-1H-imidazol-4-ylmethyl)-piperazine; hydrochloride | CHEMBL540039
Type:
Small organic molecule
Emp. Form.:
C20H24N4
Mol. Mass.:
320.4314
SMILES:
C([C@H]1CNC(=N1)c1ccccc1)N1CCN(CC1)c1ccccc1
: