Target
D(1A) dopamine receptor
Ligand
BDBM50104345
Substrate
Meas. Tech.
ChEBML_60342
Ki
2000±n/a nM
Citation
 Einsiedel, JHübner, HGmeiner, P Benzamide bioisosteres incorporating dihydroheteroazole substructures: EPC synthesis and SAR leading to a selective dopamine D4 receptor partial agonist (FAUC 179). Bioorg Med Chem Lett 11:2533-6 (2001)  
Target
Name:
D(1A) dopamine receptor
Synonyms:
D(1A) dopamine receptor DOPAMINE D1 DRD1_BOVIN | Dopamine receptor
Type:
Enzyme Catalytic Domain
Mol. Mass.:
49330.65
Organism:
BOVINE
Description:
DOPAMINE D1 DRD1 BOVINE::Q95136
Residue:
446
  
Inhibitor
Name:
BDBM50104345
Synonyms:
1-((4S,5S)-5-Methyl-2-phenyl-4,5-dihydro-oxazol-4-ylmethyl)-4-phenyl-piperazine | CHEMBL83306
Type:
Small organic molecule
Emp. Form.:
C21H25N3O
Mol. Mass.:
335.4427
SMILES:
C[C@@H]1OC(=N[C@H]1CN1CCN(CC1)c1ccccc1)c1ccccc1
: