Target
D(4) dopamine receptor
Ligand
BDBM50104342
Substrate
Meas. Tech.
ChEMBL_60815 (CHEMBL674967)
Ki
1600±n/a nM
Citation
 Einsiedel, JHübner, HGmeiner, P Benzamide bioisosteres incorporating dihydroheteroazole substructures: EPC synthesis and SAR leading to a selective dopamine D4 receptor partial agonist (FAUC 179). Bioorg Med Chem Lett 11:2533-6 (2001)  
Target
Name:
D(4) dopamine receptor
Synonyms:
D(2C) dopamine receptor DOPAMINE D4.2 DRD4 Dopamine D4 receptor
Type:
Enzyme
Mol. Mass.:
48373.19
Organism:
Homo sapiens (Human)
Description:
P21917
Residue:
419
  
Inhibitor
Name:
BDBM50104342
Synonyms:
1-[(S)-2-(5-Bromo-2-methoxy-phenyl)-4,5-dihydro-oxazol-4-ylmethyl]-4-phenyl-piperazine | CHEMBL313320
Type:
Small organic molecule
Emp. Form.:
C21H24BrN3O2
Mol. Mass.:
430.338
SMILES:
COc1ccc(Br)cc1C1=N[C@@H](CN2CCN(CC2)c2ccccc2)CO1
: