Target
D(3) dopamine receptor
Ligand
BDBM50104343
Substrate
Meas. Tech.
ChEMBL_62299 (CHEMBL675221)
Ki
690±n/a nM
Citation
 Einsiedel, JHübner, HGmeiner, P Benzamide bioisosteres incorporating dihydroheteroazole substructures: EPC synthesis and SAR leading to a selective dopamine D4 receptor partial agonist (FAUC 179). Bioorg Med Chem Lett 11:2533-6 (2001)  
Target
Name:
D(3) dopamine receptor
Synonyms:
DOPAMINE D3 DRD3_HUMAN Dopamine D3 receptor (D3) Dopamine receptor Dopamine receptor D3
Type:
Mol. Mass.:
44243.43
Organism:
Homo sapiens (Human)
Description:
Residue:
400
  
Inhibitor
Name:
BDBM50104343
Synonyms:
1-Phenyl-4-((S)-2-phenyl-4,5-dihydro-oxazol-4-ylmethyl)-piperazine | CHEMBL86060
Type:
Small organic molecule
Emp. Form.:
C20H23N3O
Mol. Mass.:
321.4161
SMILES:
C([C@H]1COC(=N1)c1ccccc1)N1CCN(CC1)c1ccccc1
: