Target
D(3) dopamine receptor
Ligand
BDBM84637
Substrate
Meas. Tech.
ChEMBL_62300 (CHEMBL675222)
Ki
24±n/a nM
Citation
 Einsiedel, JHübner, HGmeiner, P Benzamide bioisosteres incorporating dihydroheteroazole substructures: EPC synthesis and SAR leading to a selective dopamine D4 receptor partial agonist (FAUC 179). Bioorg Med Chem Lett 11:2533-6 (2001)  
Target
Name:
D(3) dopamine receptor
Synonyms:
DOPAMINE D3 DRD3_HUMAN Dopamine D3 receptor (D3) Dopamine receptor Dopamine receptor D3
Type:
Mol. Mass.:
44243.43
Organism:
Homo sapiens (Human)
Description:
Residue:
400
  
Inhibitor
Name:
BDBM84637
Synonyms:
CAS_85760-74-3 NSC_54562 Quinpirole,(-) | US9359372, Quinpirole
Type:
Small organic molecule
Emp. Form.:
C13H21N3
Mol. Mass.:
219.3259
SMILES:
CCCN1CCC[C@@H]2Cc3[nH]ncc3C[C@@H]12
: